Reaction Details
TargetD(2) dopamine receptor
LigandBDBM50036647
Substrate/Competitorn/a
Meas. Tech.ChEBML_62225
Ki 4.4±n/a nM
Citation Mewshaw, RESilverman, LSMathew, RMKaiser, CSherrill, RGCheng, MTiffany, CWKarbon, EWBailey, MABorosky, SA Bridged gamma-carbolines and derivatives possessing selective and combined affinity for 5-HT2 and D2 receptors. J Med Chem36:1488-95 (1993) D(2) dopamine receptor
Name:D(2) dopamine receptor
Type:G Protein-Coupled Receptor (GPCR)
Mol. Mass.:50931.60
Organism:Rattus norvegicus (rat)
Description:P61169
Residue:444
BDBM50036647
NameBDBM50036647
Synonyms:(7R,10S)-5-[9,15-diazatetracyclo[10.2.1.02,10.03,8]pentadeca-2(10),3,5,7-tetraen-15-yl]-1-(4-fluorophenyl)-1-pentanone 5-[9,15-diazatetracyclo[10.2.1.02,10.03,8]pentadeca-2(10),3,5,7-tetraen-15-yl]-1-(4-fluorophenyl)-1-pentanone | CHEMBL285712
TypeSmall organic molecule
Emp. Form.C24H25FN2O
Mol. Mass.376.4665
SMILESFc1ccc(cc1)C(=O)CCCCN1C2CCC1c1c(C2)[nH]c2ccccc12