Reaction Details
Target5-hydroxytryptamine receptor 2A/2B/2C
LigandBDBM50001775
Substrate/Competitorn/a
Meas. Tech.ChEMBL_2136 (CHEMBL617219)
Ki 0.820000±n/a nM
Citation Mewshaw, RESilverman, LSMathew, RMKaiser, CSherrill, RGCheng, MTiffany, CWKarbon, EWBailey, MABorosky, SA Bridged gamma-carbolines and derivatives possessing selective and combined affinity for 5-HT2 and D2 receptors. J Med Chem36:1488-95 (1993) 5-hydroxytryptamine receptor 2A/2B/2C
Name:5-hydroxytryptamine receptor 2A/2B/2C
Synonyms:Serotonin 2 (5-HT2) receptor
Type:n/a
Mol. Mass.:n/a
Description:ASSAY_ID of ChEMBL is 2124
Components:This complex has 3 components.
Component 1
Name:5-hydroxytryptamine receptor 2C
Type:Enzyme
Mol. Mass.:51948.16
Organism:Mus musculus (Mouse)
Description:P34968
Residue:459
Component 2
Name:5-hydroxytryptamine receptor 2A
Synonyms:5-HT-2 5-hydroxytryptamine receptor 2A 5HT2A_MOUSE Htr2 Serotonin 2a (5-HT2a) receptor
Type:Enzyme
Mol. Mass.:52843.00
Organism:Mus musculus (Mouse)
Description:P35363
Residue:471
Component 3
Name:5-hydroxytryptamine receptor 2B
Synonyms:5-HT2 5-hydroxytryptamine receptor 2B 5HT2B_MOUSE Htr2b
Type:Enzyme
Mol. Mass.:53610.91
Organism:Mus musculus (Mouse)
Description:Q02152
Residue:479
BDBM50001775
NameBDBM50001775
Synonyms:(ritanserin)6-(2-{4-[Bis-(4-fluoro-phenyl)-methylene]-piperidin-1-yl}-ethyl)-7-methyl-2,3-dihydro-1H-indolizin-5-one 6-(2-(4-(bis(4-fluorophenyl)methylene)piperidin-1-yl)ethyl)-7-methyl-5H-thiazolo[3,2-a]pyrimidin-5-one 6-(2-{4-[Bis-(4-fluoro-phenyl)-methylene]-piperidin-1-yl}-ethyl)-7-methyl-thiazolo[3,2-a]pyrimidin-5-one 6-(2-{4-[Bis-(4-fluoro-phenyl)-methylene]-piperidin-1-yl}-ethyl)-7-methyl-thiazolo[3,2-a]pyrimidin-5-one(Ritanserin) RITANSERIN cid_5074
TypeSmall organic molecule
Emp. Form.C27H25F2N3OS
Mol. Mass.477.569
SMILES[#6]-c1nc2sccn2c(=O)c1-[#6]-[#6]-[#7]-1-[#6]-[#6]\[#6](-[#6]-[#6]-1)=[#6](\c1ccc(F)cc1)-c1ccc(F)cc1