Reaction Details
Target5-hydroxytryptamine receptor 2A/2B/2C
LigandBDBM50047437
Substrate/Competitorn/a
Meas. Tech.ChEMBL_2136 (CHEMBL617219)
Ki 13±n/a nM
Citation Mewshaw, RESilverman, LSMathew, RMKaiser, CSherrill, RGCheng, MTiffany, CWKarbon, EWBailey, MABorosky, SA Bridged gamma-carbolines and derivatives possessing selective and combined affinity for 5-HT2 and D2 receptors. J Med Chem36:1488-95 (1993) 5-hydroxytryptamine receptor 2A/2B/2C
Name:5-hydroxytryptamine receptor 2A/2B/2C
Synonyms:Serotonin 2 (5-HT2) receptor
Type:n/a
Mol. Mass.:n/a
Description:ASSAY_ID of ChEMBL is 2124
Components:This complex has 3 components.
Component 1
Name:5-hydroxytryptamine receptor 2C
Type:Enzyme
Mol. Mass.:51948.16
Organism:Mus musculus (Mouse)
Description:P34968
Residue:459
Component 2
Name:5-hydroxytryptamine receptor 2A
Synonyms:5-HT-2 5-hydroxytryptamine receptor 2A 5HT2A_MOUSE Htr2 Serotonin 2a (5-HT2a) receptor
Type:Enzyme
Mol. Mass.:52843.00
Organism:Mus musculus (Mouse)
Description:P35363
Residue:471
Component 3
Name:5-hydroxytryptamine receptor 2B
Synonyms:5-HT2 5-hydroxytryptamine receptor 2B 5HT2B_MOUSE Htr2b
Type:Enzyme
Mol. Mass.:53610.91
Organism:Mus musculus (Mouse)
Description:Q02152
Residue:479
BDBM50047437
NameBDBM50047437
Synonyms:1-(6-fluorobenzo[d]isoxazol-3-yl)-3-[5-fluoro-9,16-diazatetracyclo[10.3.1.02,10.03,8]hexadeca-2(10),3,5,7-tetraen-16-yl]propane | CHEMBL35096
TypeSmall organic molecule
Emp. Form.C24H23F2N3O
Mol. Mass.407.4557
SMILESFc1ccc2c(CCCN3C4CCCC3c3c(C4)[nH]c4ccc(F)cc34)noc2c1