Reaction Details
TargetProtease
LigandBDBM8125
Substrate/Competitorn/a
Meas. Tech.ChEMBL_1523253 (CHEMBL3632388)
Ki 0.016±n/a nM
Citation Ghosh, AKTakayama, JKassekert, LAElla-Menye, JRYashchuk, SAgniswamy, JWang, YFAoki, MAmano, MWeber, ITMitsuya, H Structure-based design, synthesis, X-ray studies, and biological evaluation of novel HIV-1 protease inhibitors containing isophthalamide-derived P2-ligands. Bioorg Med Chem Lett25:4903-4909 (2015) 
 
Protease
Name:Protease
Synonyms:n/a
Type:Enzyme
Mol. Mass.:10904.79
Organism:Human immunodeficiency virus 1 (HIV-1)
Description:Q9YQ12
Residue:99
BDBM8125
NameBDBM8125
TypeSmall organic molecule
Emp. Form.C27H37N3O7S
Mol. Mass.547.664
SMILES[H][C@@]1(CO[C@@]2([H])OCC[C@@]12[H])OC(=O)N[C@@H](Cc1ccccc1)[C@H](O)CN(CC(C)C)S(=O)(=O)c1ccc(N)cc1