Reaction Details
TargetPolyunsaturated fatty acid 5-lipoxygenase
LigandBDBM22971
Substrate/Competitorn/a
Meas. Tech.ChEBML_3968
IC50 24000±n/a nM
Citation Boschelli, DHConnor, DTBornemeier, DADyer, RDKennedy, JAKuipers, PJOkonkwo, GCSchrier, DJWright, CD 1,3,4-Oxadiazole, 1,3,4-thiadiazole, and 1,2,4-triazole analogs of the fenamates: in vitro inhibition of cyclooxygenase and 5-lipoxygenase activities. J Med Chem36:1802-10 (1993) Polyunsaturated fatty acid 5-lipoxygenase
Name:Polyunsaturated fatty acid 5-lipoxygenase
Type:PROTEIN
Mol. Mass.:78082.31
Organism:Rattus norvegicus
Description:ChEMBL_1432947
Residue:673
BDBM22971
NameBDBM22971
Synonyms:2-[(2,6-dichloro-3-methylphenyl)amino]benzoic acid Meclofenamate US11337935, Compound Meclofenamic-acid | US20240002326, Compound Meclofenamic acid
TypeSmall organic molecule
Emp. Form.C14H11Cl2NO2
Mol. Mass.296.149
SMILESCc1ccc(Cl)c(Nc2ccccc2C(O)=O)c1Cl