Reaction Details
TargetSphingosine 1-phosphate receptor 5
LigandBDBM23163
Substrate/Competitorn/a
Meas. Tech.ChEMBL_1542440 (CHEMBL3743674)
EC50 3.4±n/a nM
Citation Hobson, ADHarris, CMvan der Kam, ELTurner, SCAbibi, AAguirre, ALBousquet, PKebede, TKonopacki, DBGintant, GKim, YLarson, KMaull, JWMoore, NSShi, DShrestha, ATang, XZhang, PSarris, KK Discovery of A-971432, An Orally Bioavailable Selective Sphingosine-1-Phosphate Receptor 5 (S1P5) Agonist for the Potential Treatment of Neurodegenerative Disorders. J Med Chem58:9154-70 (2015) 
 
Sphingosine 1-phosphate receptor 5
Name:Sphingosine 1-phosphate receptor 5
Type:G Protein-Coupled Receptor (GPCR)
Mol. Mass.:41796.42
Organism:Homo sapiens (Human)
Description:n/a
Residue:398
BDBM23163
NameBDBM23163
Synonyms:CHEMBL114606 {2-amino-3-hydroxy-2-[2-(4-octylphenyl)ethyl]propoxy}phosphonic acid
TypeSmall organic molecule
Emp. Form.C19H34NO5P
Mol. Mass.387.4507
SMILESCCCCCCCCc1ccc(CCC(N)(CO)COP(O)(O)=O)cc1