Reaction Details
TargetD(2) dopamine receptor
LigandBDBM50048800
Substrate/Competitorn/a
Meas. Tech.ChEMBL_62860 (CHEMBL677675)
Ki 5.1±n/a nM
Citation Howard, HRLowe, JASeeger, TFSeymour, PAZorn, SHMaloney, PREwing, FENewman, MESchmidt, AWFurman, JSRobinson, GLJackson, EJohnson, CMorrone, J 3-Benzisothiazolylpiperazine derivatives as potential atypical antipsychotic agents. J Med Chem39:143-8 (1996) 
 
D(2) dopamine receptor
Name:D(2) dopamine receptor
Type:G Protein-Coupled Receptor (GPCR)
Mol. Mass.:50931.60
Organism:Rattus norvegicus (rat)
Description:P61169
Residue:444
BDBM50048800
NameBDBM50048800
Synonyms:6-[2-(4-Benzo[d]isothiazol-3-yl-piperazin-1-yl)-ethyl]-3H-benzothiazol-2-one | CHEMBL284847
TypeSmall organic molecule
Emp. Form.C20H20N4OS2
Mol. Mass.396.529
SMILESO=c1[nH]c2ccc(CCN3CCN(CC3)c3nsc4ccccc34)cc2s1