Reaction Details
TargetD(2) dopamine receptor
LigandBDBM21398
Substrate/Competitorn/a
Meas. Tech.ChEMBL_62860 (CHEMBL677675)
Ki 0.71±n/a nM
Citation Howard, HRLowe, JASeeger, TFSeymour, PAZorn, SHMaloney, PREwing, FENewman, MESchmidt, AWFurman, JSRobinson, GLJackson, EJohnson, CMorrone, J 3-Benzisothiazolylpiperazine derivatives as potential atypical antipsychotic agents. J Med Chem39:143-8 (1996) 
 
D(2) dopamine receptor
Name:D(2) dopamine receptor
Type:G Protein-Coupled Receptor (GPCR)
Mol. Mass.:50931.60
Organism:Rattus norvegicus (rat)
Description:P61169
Residue:444
BDBM21398
NameBDBM21398
Synonyms:4-[4-(4-Chloro-phenyl)-4-hydroxy-piperidin-1-yl]-1-(4-fluoro-phenyl)-butan-1-one;propionate(HCl) CHEMBL54 Haloperidol | Haloperidol, 1
TypeSmall organic molecule
Emp. Form.C21H23ClFNO2
Mol. Mass.375.864
SMILESOC1(CCN(CCCC(=O)c2ccc(F)cc2)CC1)c1ccc(Cl)cc1