Reaction Details
Target5-hydroxytryptamine receptor 1D
LigandBDBM50049082
Substrate/Competitorn/a
Meas. Tech.ChEMBL_1997 (CHEMBL617599)
Ki 1.6±n/a nM
Citation Glennon, RAHong, SSBondarev, MLaw, HDukat, MRakhi, SPower, PFan, EKinneau, DKamboj, RTeitler, MHerrick-Davis, KSmith, C Binding of O-alkyl derivatives of serotonin at human 5-HT1D beta receptors. J Med Chem39:314-22 (1996) 
 
5-hydroxytryptamine receptor 1D
Name:5-hydroxytryptamine receptor 1D
Type:G Protein-Coupled Receptor (GPCR)
Mol. Mass.:41920.63
Organism:Homo sapiens (Human)
Description:Receptor binding assays were performed using human clone stably expressed in CHO cells.
Residue:377
BDBM50049082
NameBDBM50049082
Synonyms:2-(5-Octyloxy-1H-indol-3-yl)-ethylamine | CHEMBL326667
TypeSmall organic molecule
Emp. Form.C18H28N2O
Mol. Mass.288.4277
SMILESCCCCCCCCOc1ccc2[nH]cc(CCN)c2c1