Reaction Details
Target5-hydroxytryptamine receptor 1A
LigandBDBM50049077
Substrate/Competitorn/a
Meas. Tech.ChEMBL_910 (CHEMBL615759)
Ki 42±n/a nM
Citation Glennon, RAHong, SSBondarev, MLaw, HDukat, MRakhi, SPower, PFan, EKinneau, DKamboj, RTeitler, MHerrick-Davis, KSmith, C Binding of O-alkyl derivatives of serotonin at human 5-HT1D beta receptors. J Med Chem39:314-22 (1996) 
 
5-hydroxytryptamine receptor 1A
Name:5-hydroxytryptamine receptor 1A
Type:n/a
Mol. Mass.:46122.49
Organism:Homo sapiens (Human)
Description:n/a
Residue:422
BDBM50049077
NameBDBM50049077
Synonyms:2-(5-Pentyloxy-1H-indol-3-yl)-ethylamine | CHEMBL111376
TypeSmall organic molecule
Emp. Form.C15H22N2O
Mol. Mass.246.348
SMILESCCCCCOc1ccc2[nH]cc(CCN)c2c1