Reaction Details
Target5-hydroxytryptamine receptor 1A
LigandBDBM50049081
Substrate/Competitorn/a
Meas. Tech.ChEMBL_910 (CHEMBL615759)
Ki 63±n/a nM
Citation Glennon, RAHong, SSBondarev, MLaw, HDukat, MRakhi, SPower, PFan, EKinneau, DKamboj, RTeitler, MHerrick-Davis, KSmith, C Binding of O-alkyl derivatives of serotonin at human 5-HT1D beta receptors. J Med Chem39:314-22 (1996) 
 
5-hydroxytryptamine receptor 1A
Name:5-hydroxytryptamine receptor 1A
Type:n/a
Mol. Mass.:46122.49
Organism:Homo sapiens (Human)
Description:n/a
Residue:422
BDBM50049081
NameBDBM50049081
Synonyms:2-[5-(8,8-Dimethyl-nonyloxy)-1H-indol-3-yl]-ethylamine | CHEMBL107617
TypeSmall organic molecule
Emp. Form.C21H34N2O
Mol. Mass.330.5075
SMILESCC(C)(C)CCCCCCCOc1ccc2[nH]cc(CCN)c2c1