Reaction Details
Target5-hydroxytryptamine receptor 1A
LigandBDBM50049084
Substrate/Competitorn/a
Meas. Tech.ChEMBL_910 (CHEMBL615759)
Ki 920±n/a nM
Citation Glennon, RAHong, SSBondarev, MLaw, HDukat, MRakhi, SPower, PFan, EKinneau, DKamboj, RTeitler, MHerrick-Davis, KSmith, C Binding of O-alkyl derivatives of serotonin at human 5-HT1D beta receptors. J Med Chem39:314-22 (1996) 
 
5-hydroxytryptamine receptor 1A
Name:5-hydroxytryptamine receptor 1A
Type:n/a
Mol. Mass.:46122.49
Organism:Homo sapiens (Human)
Description:n/a
Residue:422
BDBM50049084
NameBDBM50049084
Synonyms:2-[5-(7,7-Dimethyl-octyloxy)-1H-indol-3-yl]-ethylamine | CHEMBL111150
TypeSmall organic molecule
Emp. Form.C20H32N2O
Mol. Mass.316.4809
SMILESCC(C)(C)CCCCCCOc1ccc2[nH]cc(CCN)c2c1