Reaction Details
Target5-hydroxytryptamine receptor 1B
LigandBDBM50049093
Substrate/Competitorn/a
Meas. Tech.ChEMBL_2025 (CHEMBL617320)
Ki 1.1±n/a nM
Citation Glennon, RAHong, SSBondarev, MLaw, HDukat, MRakhi, SPower, PFan, EKinneau, DKamboj, RTeitler, MHerrick-Davis, KSmith, C Binding of O-alkyl derivatives of serotonin at human 5-HT1D beta receptors. J Med Chem39:314-22 (1996) 
 
5-hydroxytryptamine receptor 1B
Name:5-hydroxytryptamine receptor 1B
Type:G Protein-Coupled Receptor (GPCR)
Mol. Mass.:43579.17
Organism:Homo sapiens (Human)
Description:Receptor binding assays were performed using human clone stably expressed in CHO cells
Residue:390
BDBM50049093
NameBDBM50049093
Synonyms:CHEMBL321190 | Nonanoic acid 3-(2-dimethylamino-ethyl)-1H-indol-5-yl ester
TypeSmall organic molecule
Emp. Form.C21H32N2O2
Mol. Mass.344.491
SMILESCCCCCCCCC(=O)Oc1ccc2[nH]cc(CCN(C)C)c2c1