Reaction Details
Target5-hydroxytryptamine receptor 1D
LigandBDBM50049079
Substrate/Competitorn/a
Meas. Tech.ChEMBL_1639 (CHEMBL616731)
Ki 17±n/a nM
Citation Glennon, RAHong, SSBondarev, MLaw, HDukat, MRakhi, SPower, PFan, EKinneau, DKamboj, RTeitler, MHerrick-Davis, KSmith, C Binding of O-alkyl derivatives of serotonin at human 5-HT1D beta receptors. J Med Chem39:314-22 (1996) 
 
5-hydroxytryptamine receptor 1D
Name:5-hydroxytryptamine receptor 1D
Type:G Protein-Coupled Receptor (GPCR)
Mol. Mass.:41920.63
Organism:Homo sapiens (Human)
Description:Receptor binding assays were performed using human clone stably expressed in CHO cells.
Residue:377
BDBM50049079
NameBDBM50049079
Synonyms:CHEMBL322349 | Propionic acid 3-(2-dimethylamino-ethyl)-1H-indol-5-yl ester
TypeSmall organic molecule
Emp. Form.C15H20N2O2
Mol. Mass.260.3315
SMILESCCC(=O)Oc1ccc2[nH]cc(CCN(C)C)c2c1