Reaction Details
Target5-hydroxytryptamine receptor 1B
LigandBDBM50049099
Substrate/Competitorn/a
Meas. Tech.ChEMBL_2025 (CHEMBL617320)
Ki 5.5±n/a nM
Citation Glennon, RAHong, SSBondarev, MLaw, HDukat, MRakhi, SPower, PFan, EKinneau, DKamboj, RTeitler, MHerrick-Davis, KSmith, C Binding of O-alkyl derivatives of serotonin at human 5-HT1D beta receptors. J Med Chem39:314-22 (1996) 
 
5-hydroxytryptamine receptor 1B
Name:5-hydroxytryptamine receptor 1B
Type:G Protein-Coupled Receptor (GPCR)
Mol. Mass.:43579.17
Organism:Homo sapiens (Human)
Description:Receptor binding assays were performed using human clone stably expressed in CHO cells
Residue:390
BDBM50049099
NameBDBM50049099
Synonyms:CHEMBL50492 | [2-(5-Ethyl-1H-indol-3-yl)-ethyl]-dimethyl-amine
TypeSmall organic molecule
Emp. Form.C14H20N2
Mol. Mass.216.322
SMILESCCc1ccc2[nH]cc(CCN(C)C)c2c1