Reaction Details
TargetHistone deacetylase 6
LigandBDBM50005711
Substrate/Competitorn/a
Meas. Tech.ChEMBL_1541058 (CHEMBL3744289)
EC50 5.2±n/a nM
Citation Zwick, VNurisso, ASimões-Pires, CBouchet, SMartinet, NLehotzky, AOvadi, JCuendet, MBlanquart, CBertrand, P Cross metathesis with hydroxamate and benzamide BOC-protected alkenes to access HDAC inhibitors and their biological evaluation highlighted intrinsic activity of BOC-protected dihydroxamates. Bioorg Med Chem Lett26:154-9 (2016) 
 
Histone deacetylase 6
Name:Histone deacetylase 6
Type:Chromatin regulator; hydrolase; repressor
Mol. Mass.:131381.51
Organism:Homo sapiens (Human)
Description:Q9UBN7
Residue:1215
BDBM50005711
NameBDBM50005711
Synonyms:CHEBI:46024 TRICHOSTATIN Trichostatin A (TSA) US10722597, Compound Trichostatin US20230322747, Compound trichostatin A | US9265734, TSA
TypeSmall organic molecule
Emp. Form.C17H22N2O3
Mol. Mass.302.3682
SMILESC[C@H](\C=C(/C)\C=C\C(=O)NO)C(=O)c1ccc(cc1)N(C)C