Reaction Details
TargetPeroxisome proliferator-activated receptor gamma
LigandBDBM50049239
Substrate/Competitorn/a
Meas. Tech.ChEMBL_154537 (CHEMBL760257)
EC50 140±n/a nM
Citation Willson, TMCobb, JECowan, DJWiethe, RWCorrea, IDPrakash, SRBeck, KDMoore, LBKliewer, SALehmann, JM The structure-activity relationship between peroxisome proliferator-activated receptor gamma agonism and the antihyperglycemic activity of thiazolidinediones. J Med Chem39:665-8 (1996) 
 
Peroxisome proliferator-activated receptor gamma
Name:Peroxisome proliferator-activated receptor gamma
Type:PROTEIN
Mol. Mass.:57593.55
Organism:Mus musculus
Description:ChEMBL_1453700
Residue:505
BDBM50049239
NameBDBM50049239
Synonyms:5-[1-{4-[2-(Benzooxazol-2-yl-methyl-amino)-ethoxy]-phenyl}-meth-(Z)-ylidene]-thiazolidine-2,4-dione | CHEMBL128884
TypeSmall organic molecule
Emp. Form.C20H17N3O4S
Mol. Mass.395.432
SMILESCN(CCOc1ccc(C=C2SC(O)=NC2=O)cc1)c1nc2ccccc2o1