Reaction Details
TargetSubstance-P receptor
LigandBDBM50049314
Substrate/Competitorn/a
Meas. Tech.ChEMBL_205731 (CHEMBL809498)
IC50 2±n/a nM
Citation Hipskind, PAHowbert, JJBruns, RFCho, SSCrowell, TAForeman, MMGehlert, DRIyengar, SJohnson, KWKrushinski, JHLi, DLLobb, KLMason, NRMuehl, BSNixon, JAPhebus, LARegoli, DSimmons, RMThrelkeld, PGWaters, DCGitter, BD 3-Aryl-1,2-diacetamidopropane derivatives as novel and potent NK-1 receptor antagonists. J Med Chem39:736-48 (1996) 
 
Substance-P receptor
Name:Substance-P receptor
Type:G Protein-Coupled Receptor (GPCR)
Mol. Mass.:46254.43
Organism:Homo sapiens (Human)
Description:P25103
Residue:407
BDBM50049314
NameBDBM50049314
Synonyms:CHEMBL350366 | N-{3-(1H-Indol-3-yl)-2-[2-(4-phenyl-piperazin-1-yl)-acetylamino]-propyl}-N-(2-methoxy-benzyl)-benzamide
TypeSmall organic molecule
Emp. Form.C38H41N5O3
Mol. Mass.615.7638
SMILESCOc1ccccc1CN(CC(Cc1c[nH]c2ccccc12)NC(=O)CN1CCN(CC1)c1ccccc1)C(=O)c1ccccc1