Reaction Details
TargetSubstance-P receptor
LigandBDBM50049323
Substrate/Competitorn/a
Meas. Tech.ChEMBL_205731 (CHEMBL809498)
IC50 3.1±n/a nM
Citation Hipskind, PAHowbert, JJBruns, RFCho, SSCrowell, TAForeman, MMGehlert, DRIyengar, SJohnson, KWKrushinski, JHLi, DLLobb, KLMason, NRMuehl, BSNixon, JAPhebus, LARegoli, DSimmons, RMThrelkeld, PGWaters, DCGitter, BD 3-Aryl-1,2-diacetamidopropane derivatives as novel and potent NK-1 receptor antagonists. J Med Chem39:736-48 (1996) 
 
Substance-P receptor
Name:Substance-P receptor
Type:G Protein-Coupled Receptor (GPCR)
Mol. Mass.:46254.43
Organism:Homo sapiens (Human)
Description:P25103
Residue:407
BDBM50049323
NameBDBM50049323
Synonyms:CHEMBL351253 | N-[1-{[Acetyl-(2-methoxy-benzyl)-amino]-methyl}-2-(1H-indol-3-yl)-ethyl]-2-(4-phenyl-3,6-dihydro-2H-pyridin-1-yl)-acetamide
TypeSmall organic molecule
Emp. Form.C34H38N4O3
Mol. Mass.550.6905
SMILESCOc1ccccc1CN(CC(Cc1c[nH]c2ccccc12)NC(=O)CN1CCC(=CC1)c1ccccc1)C(C)=O