Reaction Details
TargetSubstance-P receptor
LigandBDBM50049353
Substrate/Competitorn/a
Meas. Tech.ChEMBL_205731 (CHEMBL809498)
IC50 5.5±n/a nM
Citation Hipskind, PAHowbert, JJBruns, RFCho, SSCrowell, TAForeman, MMGehlert, DRIyengar, SJohnson, KWKrushinski, JHLi, DLLobb, KLMason, NRMuehl, BSNixon, JAPhebus, LARegoli, DSimmons, RMThrelkeld, PGWaters, DCGitter, BD 3-Aryl-1,2-diacetamidopropane derivatives as novel and potent NK-1 receptor antagonists. J Med Chem39:736-48 (1996) 
 
Substance-P receptor
Name:Substance-P receptor
Type:G Protein-Coupled Receptor (GPCR)
Mol. Mass.:46254.43
Organism:Homo sapiens (Human)
Description:P25103
Residue:407
BDBM50049353
NameBDBM50049353
Synonyms:CHEMBL165566 | {3-(1H-Indol-3-yl)-2-[2-(4-phenyl-piperazin-1-yl)-acetylamino]-propyl}-(2-methoxy-benzyl)-carbamic acid ethyl ester
TypeSmall organic molecule
Emp. Form.C34H41N5O4
Mol. Mass.583.7204
SMILESCCOC(=O)N(CC(Cc1c[nH]c2ccccc12)NC(=O)CN1CCN(CC1)c1ccccc1)Cc1ccccc1OC