Reaction Details
TargetDihydrofolate reductase
LigandBDBM50049604
Substrate/Competitorn/a
Meas. Tech.ChEMBL_55116 (CHEMBL884367)
IC50 7.3±n/a nM
Citation Gangjee, AZhu, YQueener, SFFrancom, PBroom, AD Nonclassical 2,4-diamino-8-deazafolate analogues as inhibitors of dihydrofolate reductases from rat liver, Pneumocystis carinii, and Toxoplasma gondii. J Med Chem39:1836-45 (1996) 
 
Dihydrofolate reductase
Name:Dihydrofolate reductase
Type:Enzyme
Mol. Mass.:21638.84
Organism:Rattus norvegicus (rat)
Description:n/a
Residue:187
BDBM50049604
NameBDBM50049604
Synonyms:6-[(Methyl-naphthalen-1-yl-amino)-methyl]-pyrido[3,2-d]pyrimidine-2,4-diamine | CHEMBL54538
TypeSmall organic molecule
Emp. Form.C19H18N6
Mol. Mass.330.3864
SMILESCN(Cc1ccc2nc(N)nc(N)c2n1)c1cccc2ccccc12