Reaction Details
TargetDihydrofolate reductase
LigandBDBM50049609
Substrate/Competitorn/a
Meas. Tech.ChEMBL_55116 (CHEMBL884367)
IC50 2.7±n/a nM
Citation Gangjee, AZhu, YQueener, SFFrancom, PBroom, AD Nonclassical 2,4-diamino-8-deazafolate analogues as inhibitors of dihydrofolate reductases from rat liver, Pneumocystis carinii, and Toxoplasma gondii. J Med Chem39:1836-45 (1996) 
 
Dihydrofolate reductase
Name:Dihydrofolate reductase
Type:Enzyme
Mol. Mass.:21638.84
Organism:Rattus norvegicus (rat)
Description:n/a
Residue:187
BDBM50049609
NameBDBM50049609
Synonyms:6-{[(3,4-Dimethoxy-phenyl)-methyl-amino]-methyl}-pyrido[3,2-d]pyrimidine-2,4-diamine | CHEMBL57624
TypeSmall organic molecule
Emp. Form.C17H20N6O2
Mol. Mass.340.3797
SMILESCOc1ccc(cc1OC)N(C)Cc1ccc2nc(N)nc(N)c2n1