Reaction Details
TargetSerine/threonine-protein kinase pim-2
LigandBDBM106870
Substrate/Competitorn/a
Meas. Tech.ChEMBL_1544008 (CHEMBL3750380)
Ki 0.018000±n/a nM
Citation Burger, MTNishiguchi, GHan, WLan, JSimmons, RAtallah, GDing, YTamez, VZhang, YMathur, MMuller, KBellamacina, CLindvall, MKZang, RHuh, KFeucht, PZavorotinskaya, TDai, YBasham, SChan, JGinn, EAycinena, AHolash, JCastillo, JLangowski, JLWang, YChen, MYLambert, AFritsch, CKauffmann, APfister, EVanasse, KGGarcia, PD Identification of N-(4-((1R,3S,5S)-3-Amino-5-methylcyclohexyl)pyridin-3-yl)-6-(2,6-difluorophenyl)-5-fluoropicolinamide (PIM447), a Potent and Selective Proviral Insertion Site of Moloney Murine Leukemia (PIM) 1, 2, and 3 Kinase Inhibitor in Clinical Trials for Hematological Malignancies. J Med Chem58:8373-86 (2015) 
 
Serine/threonine-protein kinase pim-2
Name:Serine/threonine-protein kinase pim-2
Type:Serine/threonine-protein kinase
Mol. Mass.:34185.93
Organism:Homo sapiens (Human)
Description:Q9P1W9
Residue:311
BDBM106870
NameBDBM106870
Synonyms:US8592455, 70
TypeSmall organic molecule
Emp. Form.C24H23F3N4O
Mol. Mass.440.4608
SMILESC[C@@H]1C[C@H](N)C[C@@H](C1)c1ccncc1NC(=O)c1ccc(F)c(n1)-c1c(F)cccc1F