Reaction Details
TargetEndothelin-1 receptor
LigandBDBM50050026
Substrate/Competitorn/a
Meas. Tech.ChEMBL_63356 (CHEMBL679120)
IC50 5.9±n/a nM
Citation von Geldern, TWKester, JABal, RWu-Wong, JRChiou, WDixon, DBOpgenorth, TJ Azole endothelin antagonists. 2. Structure-activity studies. J Med Chem39:968-81 (1996) 
 
Endothelin-1 receptor
Name:Endothelin-1 receptor
Type:Enzyme Catalytic Domain
Mol. Mass.:48256.91
Organism:RAT
Description:ENDOTHELIN A EDNRA RAT::P26684
Residue:426
BDBM50050026
NameBDBM50050026
Synonyms:2-[(R)-1-{(S)-2-[(2,3-Dihydro-indole-1-carbonyl)-amino]-4-methyl-pentanoylamino}-2-(1-methyl-1H-indol-3-yl)-ethyl]-5-methyl-oxazole-4-carboxylic acid | CHEMBL176514
TypeSmall organic molecule
Emp. Form.C31H35N5O5
Mol. Mass.557.6401
SMILESCC(C)C[C@H](NC(=O)N1CCc2ccccc12)C(=O)N[C@H](Cc1cn(C)c2ccccc12)c1nc(C(O)=O)c(C)o1