Reaction Details
TargetEndothelin receptor type B
LigandBDBM50050063
Substrate/Competitorn/a
Meas. Tech.ChEMBL_63697 (CHEMBL670653)
IC50 90000±n/a nM
Citation von Geldern, TWHoffman, DJKester, JANellans, HNDayton, BDCalzadilla, SVMarsh, KCHernandez, LChiou, WDixon, DBWu-Wong, JROpgenorth, TJ Azole endothelin antagonists. 3. Using delta log P as a tool to improve absorption. J Med Chem39:982-91 (1996) 
 
Endothelin receptor type B
Name:Endothelin receptor type B
Type:Enzyme Catalytic Domain
Mol. Mass.:49664.00
Organism:Homo sapiens (Human)
Description:ENDOTHELIN B EDNRB HUMAN::P24530
Residue:442
BDBM50050063
NameBDBM50050063
Synonyms:2-[(R)-1-[(S)-2-(Cyclohexyl-methyl-carbamoyloxy)-4-methyl-pentanoylamino]-2-(1-methyl-1H-indol-3-yl)-ethyl]-5-methyl-oxazole-4-carboxylic acid | CHEMBL175698
TypeSmall organic molecule
Emp. Form.C30H40N4O6
Mol. Mass.552.6618
SMILESCC(C)C[C@H](OC(=O)N(C)C1CCCCC1)C(=O)N[C@H](Cc1cn(C)c2ccccc12)c1nc(C(O)=O)c(C)o1