Reaction Details
TargetEndothelin-1 receptor
LigandBDBM50050058
Substrate/Competitorn/a
Meas. Tech.ChEMBL_65491 (CHEMBL682366)
IC50 9.3±n/a nM
Citation von Geldern, TWHoffman, DJKester, JANellans, HNDayton, BDCalzadilla, SVMarsh, KCHernandez, LChiou, WDixon, DBWu-Wong, JROpgenorth, TJ Azole endothelin antagonists. 3. Using delta log P as a tool to improve absorption. J Med Chem39:982-91 (1996) 
 
Endothelin-1 receptor
Name:Endothelin-1 receptor
Type:Enzyme Catalytic Domain
Mol. Mass.:48736.88
Organism:Homo sapiens (Human)
Description:P25101
Residue:427
BDBM50050058
NameBDBM50050058
Synonyms:2-[(R)-1-((S)-2-Cyclohexylcarbamoyloxy-4-methyl-pentanoylamino)-2-(1-methyl-1H-indol-3-yl)-ethyl]-5-methyl-1H-imidazole-4-carboxylic acid | CHEMBL175228
TypeSmall organic molecule
Emp. Form.C29H39N5O5
Mol. Mass.537.6505
SMILESCC(C)C[C@H](OC(=O)NC1CCCCC1)C(=O)N[C@H](Cc1cn(C)c2ccccc12)c1nc(C(O)=O)c(C)[nH]1