Reaction Details
TargetHistamine H3 receptor
LigandBDBM50050175
Substrate/Competitorn/a
Meas. Tech.ChEMBL_83825 (CHEMBL691842)
Ki 7.9±n/a nM
Citation Stark, HPurand, KHüls, ALigneau, XGarbarg, MSchwartz, JCSchunack, W [125I]iodoproxyfan and related compounds: a reversible radioligand and novel classes of antagonists with high affinity and selectivity for the histamine H3 receptor. J Med Chem39:1220-6 (1996) 
 
Histamine H3 receptor
Name:Histamine H3 receptor
Type:G Protein-Coupled Receptor (GPCR)
Mol. Mass.:48607.98
Organism:Rattus norvegicus (rat)
Description:n/a
Residue:445
BDBM50050175
NameBDBM50050175
Synonyms:4-{3-[3-(4-Iodo-phenyl)-propoxy]-propyl}-1H-imidazole | CHEMBL20686
TypeSmall organic molecule
Emp. Form.C15H19IN2O
Mol. Mass.370.2286
SMILESIc1ccc(CCCOCCCc2cnc[nH]2)cc1