Reaction Details
TargetHistamine H3 receptor
LigandBDBM50050166
Substrate/Competitorn/a
Meas. Tech.ChEMBL_86903 (CHEMBL698413)
Ki 20±n/a nM
Citation Stark, HPurand, KHüls, ALigneau, XGarbarg, MSchwartz, JCSchunack, W [125I]iodoproxyfan and related compounds: a reversible radioligand and novel classes of antagonists with high affinity and selectivity for the histamine H3 receptor. J Med Chem39:1220-6 (1996) 
 
Histamine H3 receptor
Name:Histamine H3 receptor
Type:G Protein-Coupled Receptor (GPCR)
Mol. Mass.:48607.98
Organism:Rattus norvegicus (rat)
Description:n/a
Residue:445
BDBM50050166
NameBDBM50050166
Synonyms:4-Iodo-benzoic acid 3-(1H-imidazol-4-yl)-propyl ester | CHEMBL20295
TypeSmall organic molecule
Emp. Form.C13H13IN2O2
Mol. Mass.356.159
SMILESIc1ccc(cc1)C(=O)OCCCc1cnc[nH]1