Reaction Details
TargetGag-Pol polyprotein [489-587]
LigandBDBM50050430
Substrate/Competitorn/a
Meas. Tech.ChEMBL_196952 (CHEMBL801325)
IC50 700±n/a nM
Citation Flavin, MTRizzo, JDKhilevich, AKucherenko, ASheinkman, AKVilaychack, VLin, LChen, WGreenwood, EMPengsuparp, TPezzuto, JMHughes, SHFlavin, TMCibulski, MBoulanger, WAShone, RLXu, ZQ Synthesis, chromatographic resolution, and anti-human immunodeficiency virus activity of (+/-)-calanolide A and its enantiomers. J Med Chem39:1303-13 (1996) 
 
Gag-Pol polyprotein [489-587]
Name:Gag-Pol polyprotein [489-587]
Type:Enzyme Subunit
Mol. Mass.:10781.16
Organism:Human immunodeficiency virus type 1
Description:P04585[489-587]
Residue:99
BDBM50050430
NameBDBM50050430
Synonyms:(10S,12S)-12-Hydroxy-6,6,10,11-tetramethyl-4-propyl-11,12-dihydro-6H,10H-dipyrano[2,3-f;2',3'-h]chromen-2-one | CHEMBL282382
TypeSmall organic molecule
Emp. Form.C22H26O5
Mol. Mass.370.4388
SMILESCCCc1cc(=O)oc2c3[C@@H](O)C(C)[C@H](C)Oc3c3C=CC(C)(C)Oc3c12