Reaction Details
TargetcGMP-specific 3',5'-cyclic phosphodiesterase
LigandBDBM50050598
Substrate/Competitorn/a
Meas. Tech.ChEMBL_155200 (CHEMBL763673)
IC50 3±n/a nM
Citation Dumaître, BDodic, N Synthesis and cyclic GMP phosphodiesterase inhibitory activity of a series of 6-phenylpyrazolo[3,4-d]pyrimidones. J Med Chem39:1635-44 (1996) 
 
cGMP-specific 3',5'-cyclic phosphodiesterase
Name:cGMP-specific 3',5'-cyclic phosphodiesterase
Type:Protein
Mol. Mass.:99975.83
Organism:Homo sapiens (Human)
Description:O76074
Residue:875
BDBM50050598
NameBDBM50050598
Synonyms:CHEMBL45367 | N-[3-(1,3-Dimethyl-4-oxo-4,5-dihydro-1H-pyrazolo[3,4-d]pyrimidin-6-yl)-4-propoxy-phenyl]-methanesulfonamide
TypeSmall organic molecule
Emp. Form.C17H21N5O4S
Mol. Mass.391.445
SMILESCCCOc1ccc(NS(C)(=O)=O)cc1-c1nc2n(C)nc(C)c2c(=O)[nH]1