Reaction Details
TargetcGMP-specific 3',5'-cyclic phosphodiesterase
LigandBDBM50050615
Substrate/Competitorn/a
Meas. Tech.ChEMBL_155200 (CHEMBL763673)
IC50 5±n/a nM
Citation Dumaître, BDodic, N Synthesis and cyclic GMP phosphodiesterase inhibitory activity of a series of 6-phenylpyrazolo[3,4-d]pyrimidones. J Med Chem39:1635-44 (1996) 
 
cGMP-specific 3',5'-cyclic phosphodiesterase
Name:cGMP-specific 3',5'-cyclic phosphodiesterase
Type:Protein
Mol. Mass.:99975.83
Organism:Homo sapiens (Human)
Description:O76074
Residue:875
BDBM50050615
NameBDBM50050615
Synonyms:6-(5-Dimethylamino-2-propoxy-phenyl)-1,3-dimethyl-1,5-dihydro-pyrazolo[3,4-d]pyrimidin-4-one | CHEMBL41004
TypeSmall organic molecule
Emp. Form.C18H23N5O2
Mol. Mass.341.4075
SMILESCCCOc1ccc(cc1-c1nc2n(C)nc(C)c2c(=O)[nH]1)N(C)C