Reaction Details
TargetcGMP-specific 3',5'-cyclic phosphodiesterase
LigandBDBM50050574
Substrate/Competitorn/a
Meas. Tech.ChEMBL_192642 (CHEMBL798774)
EC50 1500±n/a nM
Citation Dumaître, BDodic, N Synthesis and cyclic GMP phosphodiesterase inhibitory activity of a series of 6-phenylpyrazolo[3,4-d]pyrimidones. J Med Chem39:1635-44 (1996) 
 
cGMP-specific 3',5'-cyclic phosphodiesterase
Name:cGMP-specific 3',5'-cyclic phosphodiesterase
Type:PROTEIN
Mol. Mass.:94547.60
Organism:Rattus norvegicus
Description:ChEMBL_155367
Residue:833
BDBM50050574
NameBDBM50050574
Synonyms:3-Methyl-6-(2-propoxy-phenyl)-1-(2,2,2-trifluoro-ethyl)-1,5-dihydro-pyrazolo[3,4-d]pyrimidin-4-one | CHEMBL43320
TypeSmall organic molecule
Emp. Form.C17H17F3N4O2
Mol. Mass.366.3377
SMILESCCCOc1ccccc1-c1nc2n(CC(F)(F)F)nc(C)c2c(=O)[nH]1