Reaction Details
TargetEndothelin receptor type B
LigandBDBM50050788
Substrate/Competitorn/a
Meas. Tech.ChEMBL_63518 (CHEMBL877477)
Ki 1300±n/a nM
Citation Riechers, HAlbrecht, HPAmberg, WBaumann, EBernard, HBöhm, HJKlinge, DKling, AMüller, SRaschack, MUnger, LWalker, NWernet, W Discovery and optimization of a novel class of orally active nonpeptidic endothelin-A receptor antagonists. J Med Chem39:2123-8 (1996) 
 
Endothelin receptor type B
Name:Endothelin receptor type B
Type:Enzyme Catalytic Domain
Mol. Mass.:49664.00
Organism:Homo sapiens (Human)
Description:ENDOTHELIN B EDNRB HUMAN::P24530
Residue:442
BDBM50050788
NameBDBM50050788
Synonyms:2-(4,6-Dimethoxy-pyrimidin-2-yloxy)-3-methoxy-3,3-bis-(3-methoxy-phenyl)-propionic acid | CHEMBL303390
TypeSmall organic molecule
Emp. Form.C24H26N2O8
Mol. Mass.470.4718
SMILESCOc1cccc(c1)C(OC)(C(Oc1nc(OC)cc(OC)n1)C(O)=O)c1cccc(OC)c1