Reaction Details
TargetEndothelin-1 receptor
LigandBDBM50050791
Substrate/Competitorn/a
Meas. Tech.ChEMBL_65645 (CHEMBL678557)
Ki 200±n/a nM
Citation Riechers, HAlbrecht, HPAmberg, WBaumann, EBernard, HBöhm, HJKlinge, DKling, AMüller, SRaschack, MUnger, LWalker, NWernet, W Discovery and optimization of a novel class of orally active nonpeptidic endothelin-A receptor antagonists. J Med Chem39:2123-8 (1996) 
 
Endothelin-1 receptor
Name:Endothelin-1 receptor
Type:Enzyme Catalytic Domain
Mol. Mass.:48736.88
Organism:Homo sapiens (Human)
Description:P25101
Residue:427
BDBM50050791
NameBDBM50050791
Synonyms:2-(4,6-Dimethoxy-pyrimidin-2-yloxy)-3-methoxy-3,3-di-p-tolyl-propionic acid | CHEMBL303034
TypeSmall organic molecule
Emp. Form.C24H26N2O6
Mol. Mass.438.473
SMILESCOc1cc(OC)nc(OC(C(O)=O)C(OC)(c2ccc(C)cc2)c2ccc(C)cc2)n1