Reaction Details
TargetEndothelin receptor type B
LigandBDBM50050799
Substrate/Competitorn/a
Meas. Tech.ChEMBL_63518 (CHEMBL877477)
Ki 1300±n/a nM
Citation Riechers, HAlbrecht, HPAmberg, WBaumann, EBernard, HBöhm, HJKlinge, DKling, AMüller, SRaschack, MUnger, LWalker, NWernet, W Discovery and optimization of a novel class of orally active nonpeptidic endothelin-A receptor antagonists. J Med Chem39:2123-8 (1996) 
 
Endothelin receptor type B
Name:Endothelin receptor type B
Type:Enzyme Catalytic Domain
Mol. Mass.:49664.00
Organism:Homo sapiens (Human)
Description:ENDOTHELIN B EDNRB HUMAN::P24530
Residue:442
BDBM50050799
NameBDBM50050799
Synonyms:3,3-Bis-(4-chloro-phenyl)-2-(4,6-dimethoxy-pyrimidin-2-yloxy)-3-methoxy-propionic acid | CHEMBL64009
TypeSmall organic molecule
Emp. Form.C22H20Cl2N2O6
Mol. Mass.479.31
SMILESCOc1cc(OC)nc(OC(C(O)=O)C(OC)(c2ccc(Cl)cc2)c2ccc(Cl)cc2)n1