Reaction Details
TargetEndothelin-1 receptor
LigandBDBM50050805
Substrate/Competitorn/a
Meas. Tech.ChEMBL_65645 (CHEMBL678557)
Ki 24±n/a nM
Citation Riechers, HAlbrecht, HPAmberg, WBaumann, EBernard, HBöhm, HJKlinge, DKling, AMüller, SRaschack, MUnger, LWalker, NWernet, W Discovery and optimization of a novel class of orally active nonpeptidic endothelin-A receptor antagonists. J Med Chem39:2123-8 (1996) 
 
Endothelin-1 receptor
Name:Endothelin-1 receptor
Type:Enzyme Catalytic Domain
Mol. Mass.:48736.88
Organism:Homo sapiens (Human)
Description:P25101
Residue:427
BDBM50050805
NameBDBM50050805
Synonyms:2-(4,6-Dimethoxy-pyrimidin-2-yloxy)-3-methoxy-3,3-di-m-tolyl-propionic acid | CHEMBL65833
TypeSmall organic molecule
Emp. Form.C24H26N2O6
Mol. Mass.438.473
SMILESCOc1cc(OC)nc(OC(C(O)=O)C(OC)(c2cccc(C)c2)c2cccc(C)c2)n1