Reaction Details
TargetEndothelin receptor type B
LigandBDBM50050793
Substrate/Competitorn/a
Meas. Tech.ChEMBL_63845 (CHEMBL673229)
Ki 20.4±n/a nM
Citation Riechers, HAlbrecht, HPAmberg, WBaumann, EBernard, HBöhm, HJKlinge, DKling, AMüller, SRaschack, MUnger, LWalker, NWernet, W Discovery and optimization of a novel class of orally active nonpeptidic endothelin-A receptor antagonists. J Med Chem39:2123-8 (1996) 
 
Endothelin receptor type B
Name:Endothelin receptor type B
Type:Enzyme Catalytic Domain
Mol. Mass.:49664.00
Organism:Homo sapiens (Human)
Description:ENDOTHELIN B EDNRB HUMAN::P24530
Residue:442
BDBM50050793
NameBDBM50050793
Synonyms:3-Methoxy-2-(4-methoxy-6,7-dihydro-5H-cyclopentapyrimidin-2-yloxy)-3,3-diphenyl-propionic acid | CHEMBL302564
TypeSmall organic molecule
Emp. Form.C24H24N2O5
Mol. Mass.420.4578
SMILESCOc1nc(OC(C(O)=O)C(OC)(c2ccccc2)c2ccccc2)nc2CCCc12