Reaction Details
TargetEndothelin-1 receptor
LigandBDBM50050792
Substrate/Competitorn/a
Meas. Tech.ChEMBL_65645 (CHEMBL678557)
Ki 86±n/a nM
Citation Riechers, HAlbrecht, HPAmberg, WBaumann, EBernard, HBöhm, HJKlinge, DKling, AMüller, SRaschack, MUnger, LWalker, NWernet, W Discovery and optimization of a novel class of orally active nonpeptidic endothelin-A receptor antagonists. J Med Chem39:2123-8 (1996) 
 
Endothelin-1 receptor
Name:Endothelin-1 receptor
Type:Enzyme Catalytic Domain
Mol. Mass.:48736.88
Organism:Homo sapiens (Human)
Description:P25101
Residue:427
BDBM50050792
NameBDBM50050792
Synonyms:2-(4,6-Dimethoxy-pyrimidin-2-yloxy)-3-phenoxy-3,3-diphenyl-propionic acid | CHEMBL66402
TypeSmall organic molecule
Emp. Form.C27H24N2O6
Mol. Mass.472.4893
SMILESCOc1cc(OC)nc(OC(C(O)=O)C(Oc2ccccc2)(c2ccccc2)c2ccccc2)n1