Reaction Details
TargetEndothelin-1 receptor
LigandBDBM50050810
Substrate/Competitorn/a
Meas. Tech.ChEMBL_65645 (CHEMBL678557)
Ki 19±n/a nM
Citation Riechers, HAlbrecht, HPAmberg, WBaumann, EBernard, HBöhm, HJKlinge, DKling, AMüller, SRaschack, MUnger, LWalker, NWernet, W Discovery and optimization of a novel class of orally active nonpeptidic endothelin-A receptor antagonists. J Med Chem39:2123-8 (1996) 
 
Endothelin-1 receptor
Name:Endothelin-1 receptor
Type:Enzyme Catalytic Domain
Mol. Mass.:48736.88
Organism:Homo sapiens (Human)
Description:P25101
Residue:427
BDBM50050810
NameBDBM50050810
Synonyms:3-Methoxy-2-(4-methyl-pyrimidin-2-yloxy)-3,3-diphenyl-propionic acid | CHEMBL306218
TypeSmall organic molecule
Emp. Form.C21H20N2O4
Mol. Mass.364.3945
SMILESCOC(C(Oc1nccc(C)n1)C(O)=O)(c1ccccc1)c1ccccc1