Reaction Details
TargetMetabotropic glutamate receptor 1
LigandBDBM50030627
Substrate/Competitorn/a
Meas. Tech.ChEMBL_105873 (CHEMBL717924)
Ki 50000±n/a nM
Citation Pellicciari, RMarinozzi, MNatalini, BCostantino, GLuneia, RGiorgi, GMoroni, FThomsen, C Synthesis and pharmacological characterization of all sixteen stereoisomers of 2-(2'-carboxy-3'-phenylcyclopropyl)glycine. Focus on (2S,1'S,2'S,3'R)-2-(2'-carboxy-3'-phenylcyclopropyl)glycine, a novel and selective group II metabotropic glutamate receptors antagonist. J Med Chem39:2259-69 (1996) 
 
Metabotropic glutamate receptor 1
Name:Metabotropic glutamate receptor 1
Type:Enzyme
Mol. Mass.:132358.19
Organism:Homo sapiens (Human)
Description:Q13255
Residue:1194
BDBM50030627
NameBDBM50030627
Synonyms:(+-)-MCPG 4-(1-Amino-1-carboxy-ethyl)-benzoic acid CHEMBL299683 | MCPG
TypeSmall organic molecule
Emp. Form.C10H11NO4
Mol. Mass.209.1986
SMILESCC(N)(C(O)=O)c1ccc(cc1)C(O)=O