Reaction Details
TargetC-C chemokine receptor type 9
LigandBDBM393522
Substrate/Competitorn/a
Meas. Tech.ChEMBL_1572912 (CHEMBL3801235)
Ki 7.0±n/a nM
Citation Kalindjian, SBKadnur, SVHewson, CAVenkateshappa, CJuluri, SKristam, RKulkarni, BMohammed, ZSaxena, RViswanadhan, VNAiyar, JMcVey, D A New Series of Orally Bioavailable Chemokine Receptor 9 (CCR9) Antagonists; Possible Agents for the Treatment of Inflammatory Bowel Disease. J Med Chem59:3098-111 (2016) 
 
C-C chemokine receptor type 9
Name:C-C chemokine receptor type 9
Type:PROTEIN
Mol. Mass.:42023.90
Organism:Homo sapiens (Human)
Description:ChEMBL_1510356
Residue:369
BDBM393522
NameBDBM393522
Synonyms:US9969687, Compound 185
TypeSmall organic molecule
Emp. Form.C24H22ClN3O4S
Mol. Mass.483.967
SMILESCc1ccncc1N1C(=O)c2c(C1=O)c(NS(=O)(=O)c1ccc(cc1)C(C)(C)C)ccc2Cl