Reaction Details
TargetEndothelin-1 receptor
LigandBDBM50050987
Substrate/Competitorn/a
Meas. Tech.ChEMBL_65499 (CHEMBL682972)
IC50 4.88±n/a nM
Citation Winn, Mvon Geldern, TWOpgenorth, TJJae, HSTasker, ASBoyd, SAKester, JAMantei, RABal, RSorensen, BKWu-Wong, JRChiou, WJDixon, DBNovosad, EIHernandez, LMarsh, KC 2,4-Diarylpyrrolidine-3-carboxylic acids--potent ETA selective endothelin receptor antagonists. 1. Discovery of A-127722. J Med Chem39:1039-48 (1996) 
 
Endothelin-1 receptor
Name:Endothelin-1 receptor
Type:Enzyme Catalytic Domain
Mol. Mass.:48736.88
Organism:Homo sapiens (Human)
Description:P25101
Residue:427
BDBM50050987
NameBDBM50050987
Synonyms:(2S,3S,4R)-4-Benzo[1,3]dioxol-5-yl-1-[(butyl-methyl-carbamoyl)-methyl]-2-(4-methoxy-phenyl)-pyrrolidine-3-carboxylic acid | CHEMBL267695
TypeSmall organic molecule
Emp. Form.C26H32N2O6
Mol. Mass.468.5421
SMILESCCCCN(C)C(=O)CN1C[C@H]([C@@H]([C@H]1c1ccc(OC)cc1)C(O)=O)c1ccc2OCOc2c1