Reaction Details
TargetEndothelin receptor type B
LigandBDBM50050964
Substrate/Competitorn/a
Meas. Tech.ChEMBL_63851 (CHEMBL673235)
Ki 5.4±n/a nM
Citation Winn, Mvon Geldern, TWOpgenorth, TJJae, HSTasker, ASBoyd, SAKester, JAMantei, RABal, RSorensen, BKWu-Wong, JRChiou, WJDixon, DBNovosad, EIHernandez, LMarsh, KC 2,4-Diarylpyrrolidine-3-carboxylic acids--potent ETA selective endothelin receptor antagonists. 1. Discovery of A-127722. J Med Chem39:1039-48 (1996) 
 
Endothelin receptor type B
Name:Endothelin receptor type B
Type:Enzyme Catalytic Domain
Mol. Mass.:49664.00
Organism:Homo sapiens (Human)
Description:ENDOTHELIN B EDNRB HUMAN::P24530
Residue:442
BDBM50050964
NameBDBM50050964
Synonyms:4-[1-Benzo[1,3]dioxol-5-yl-2-(4-isopropyl-benzenesulfonylamino)-2-oxo-ethoxy]-3-propyl-benzoic acid L-754142
TypeSmall organic molecule
Emp. Form.C28H29NO8S
Mol. Mass.539.597
SMILESCCCc1cc(ccc1OC(C(=O)NS(=O)(=O)c1ccc(cc1)C(C)C)c1ccc2OCOc2c1)C(O)=O