Reaction Details
TargetEndothelin receptor type B
LigandBDBM50041617
Substrate/Competitorn/a
Meas. Tech.ChEMBL_63851 (CHEMBL673235)
Ki 14.7±n/a nM
Citation Winn, Mvon Geldern, TWOpgenorth, TJJae, HSTasker, ASBoyd, SAKester, JAMantei, RABal, RSorensen, BKWu-Wong, JRChiou, WJDixon, DBNovosad, EIHernandez, LMarsh, KC 2,4-Diarylpyrrolidine-3-carboxylic acids--potent ETA selective endothelin receptor antagonists. 1. Discovery of A-127722. J Med Chem39:1039-48 (1996) 
 
Endothelin receptor type B
Name:Endothelin receptor type B
Type:Enzyme Catalytic Domain
Mol. Mass.:49664.00
Organism:Homo sapiens (Human)
Description:ENDOTHELIN B EDNRB HUMAN::P24530
Residue:442
BDBM50041617
NameBDBM50041617
Synonyms:(1S,2R,3S)-1-Benzo[1,3]dioxol-5-yl-3-(2-carboxymethoxy-4-methoxy-phenyl)-5-propoxy-indan-2-carboxylic acid CHEMBL8823 SB-209670
TypeSmall organic molecule
Emp. Form.C29H28O9
Mol. Mass.520.5272
SMILESCCCOc1ccc2[C@@H]([C@H]([C@@H](c2c1)c1ccc(OC)cc1OCC(O)=O)C(O)=O)c1ccc2OCOc2c1