Reaction Details
TargetEndothelin-1 receptor
LigandBDBM50050998
Substrate/Competitorn/a
Meas. Tech.ChEMBL_63357 (CHEMBL679121)
IC50 0.46±n/a nM
Citation Winn, Mvon Geldern, TWOpgenorth, TJJae, HSTasker, ASBoyd, SAKester, JAMantei, RABal, RSorensen, BKWu-Wong, JRChiou, WJDixon, DBNovosad, EIHernandez, LMarsh, KC 2,4-Diarylpyrrolidine-3-carboxylic acids--potent ETA selective endothelin receptor antagonists. 1. Discovery of A-127722. J Med Chem39:1039-48 (1996) 
 
Endothelin-1 receptor
Name:Endothelin-1 receptor
Type:Enzyme Catalytic Domain
Mol. Mass.:48256.91
Organism:RAT
Description:ENDOTHELIN A EDNRA RAT::P26684
Residue:426
BDBM50050998
NameBDBM50050998
Synonyms:4-Benzo[1,3]dioxol-5-yl-1-(1-dibutylcarbamoyl-ethyl)-2-(4-methoxy-phenyl)-pyrrolidine-3-carboxylic acid | CHEMBL9488
TypeSmall organic molecule
Emp. Form.C30H40N2O6
Mol. Mass.524.6484
SMILESCCCCN(CCCC)C(=O)C(C)N1CC(C(C1c1ccc(OC)cc1)C(O)=O)c1ccc2OCOc2c1