Reaction Details
Target5-hydroxytryptamine receptor 1A
LigandBDBM82517
Substrate/Competitorn/a
Meas. Tech.ChEMBL_1116 (CHEMBL616061)
Ki 0.6±n/a nM
Citation Mokrosz, JLDeren-Wesolek, ATatarczynska, EDuszynska, BBojarski, AJMokrosz, MJChojnacka-Wójcik, E 8-[4-[2-(1,2,3,4-Tetrahydroisoquinolinyl]butyl-8-azaspiro[4.5]decane-7,9-dione: a new 5-HT1A receptor ligand with the same activity profile as buspirone. J Med Chem39:1125-9 (1996) 
 
5-hydroxytryptamine receptor 1A
Name:5-hydroxytryptamine receptor 1A
Type:G Protein-Coupled Receptor (GPCR)
Mol. Mass.:46445.29
Organism:Rattus norvegicus (rat)
Description:Binding assays were performed using rat hippocampal membranes.
Residue:422
BDBM82517
NameBDBM82517
Synonyms:2-{4-[4-(2-Methoxy-phenyl)-piperazin-1-yl]-butyl}-isoindole-1,3-dione CHEMBL126632 NAN-190 | NSC_107966
TypeSmall organic molecule
Emp. Form.C23H27N3O3
Mol. Mass.393.4788
SMILESCOc1ccccc1N1CCN(CCCCN2C(=O)c3ccccc3C2=O)CC1