Reaction Details
Target5-hydroxytryptamine receptor 1A
LigandBDBM13016
Substrate/Competitorn/a
Meas. Tech.ChEMBL_1116 (CHEMBL616061)
Ki>50000±n/a nM
Citation Mokrosz, JLDeren-Wesolek, ATatarczynska, EDuszynska, BBojarski, AJMokrosz, MJChojnacka-Wójcik, E 8-[4-[2-(1,2,3,4-Tetrahydroisoquinolinyl]butyl-8-azaspiro[4.5]decane-7,9-dione: a new 5-HT1A receptor ligand with the same activity profile as buspirone. J Med Chem39:1125-9 (1996) 
 
5-hydroxytryptamine receptor 1A
Name:5-hydroxytryptamine receptor 1A
Type:G Protein-Coupled Receptor (GPCR)
Mol. Mass.:46445.29
Organism:Rattus norvegicus (rat)
Description:Binding assays were performed using rat hippocampal membranes.
Residue:422
BDBM13016
NameBDBM13016
Synonyms:1,2,3,4-tetrahydroisoquinoline THIQ 6 | tetrahydroisoquinoline
TypeSmall organic molecule
Emp. Form.C9H11N
Mol. Mass.133.1903
SMILESC1Cc2ccccc2CN1