Reaction Details
TargetHistamine H3 receptor
LigandBDBM50051204
Substrate/Competitorn/a
Meas. Tech.ChEMBL_83832 (CHEMBL690973)
Ki 10±n/a nM
Citation Stark, HPurand, KLigneau, XRouleau, AArrang, JMGarbarg, MSchwartz, JCSchunack, W Novel carbamates as potent histamine H3 receptor antagonists with high in vitro and oral in vivo activity. J Med Chem39:1157-63 (1996) 
 
Histamine H3 receptor
Name:Histamine H3 receptor
Type:G Protein-Coupled Receptor (GPCR)
Mol. Mass.:48607.98
Organism:Rattus norvegicus (rat)
Description:n/a
Residue:445
BDBM50051204
NameBDBM50051204
Synonyms:CHEMBL274262 | Phenethyl-carbamic acid 3-(1H-imidazol-4-yl)-propyl ester
TypeSmall organic molecule
Emp. Form.C15H19N3O2
Mol. Mass.273.3303
SMILESO=C(NCCc1ccccc1)OCCCc1cnc[nH]1