Reaction Details
TargetHistamine H3 receptor
LigandBDBM50051196
Substrate/Competitorn/a
Meas. Tech.ChEMBL_83832 (CHEMBL690973)
Ki 10±n/a nM
Citation Stark, HPurand, KLigneau, XRouleau, AArrang, JMGarbarg, MSchwartz, JCSchunack, W Novel carbamates as potent histamine H3 receptor antagonists with high in vitro and oral in vivo activity. J Med Chem39:1157-63 (1996) 
 
Histamine H3 receptor
Name:Histamine H3 receptor
Type:G Protein-Coupled Receptor (GPCR)
Mol. Mass.:48607.98
Organism:Rattus norvegicus (rat)
Description:n/a
Residue:445
BDBM50051196
NameBDBM50051196
Synonyms:CHEMBL16056 | Cyclohexylmethyl-carbamic acid 3-(1H-imidazol-4-yl)-propyl ester
TypeSmall organic molecule
Emp. Form.C14H23N3O2
Mol. Mass.265.3513
SMILESO=C(NCC1CCCCC1)OCCCc1cnc[nH]1