Reaction Details
TargetHistamine H2 receptor
LigandBDBM50050183
Substrate/Competitorn/a
Meas. Tech.ChEMBL_84898 (CHEMBL694998)
Ki 31622.78±n/a nM
Citation Stark, HPurand, KLigneau, XRouleau, AArrang, JMGarbarg, MSchwartz, JCSchunack, W Novel carbamates as potent histamine H3 receptor antagonists with high in vitro and oral in vivo activity. J Med Chem39:1157-63 (1996) 
 
Histamine H2 receptor
Name:Histamine H2 receptor
Type:G Protein-Coupled Receptor (GPCR)
Mol. Mass.:40567.22
Organism:Cavia porcellus (domestic guinea pig)
Description:For the H2 receptor-binding assays, guinea pig striatum was used.
Residue:359
BDBM50050183
NameBDBM50050183
Synonyms:(4-Iodo-benzyl)-carbamic acid 3-(1H-imidazol-4-yl)-propyl ester | CHEMBL16496
TypeSmall organic molecule
Emp. Form.C14H16IN3O2
Mol. Mass.385.2002
SMILESIc1ccc(CNC(=O)OCCCc2cnc[nH]2)cc1